{"text_format":"1","workbook":"xlsx","n_sheets":11,"sheets":["Angaben für Ihr Catering","Zusammenfassung","Coffeebreak","Working Lunch","Apéro","Getränke","Miete Geschirr","VIP Lunch","AGB","Anzeige","Tabelle1"],"not_rendered":{"charts":0,"images":2,"macros":1,"external_links":0,"defined_names":11,"comments":0,"pivot_tables":1},"unopened":[],"bounds":{"document_bytes":16777216,"sheet_cells":100000,"rows_first":2000,"rows_last":500,"rows_between":2000,"halvings":0,"cell_chars":16384,"cell_head_chars":4096},"cells_cut":0,"cells_raw":0,"read":"whole","date_system":"1900"}

{"sheet":"Angaben für Ihr Catering","index":0,"n_rows":34,"n_cols":5,"rows_kept":34,"cut":false,"hidden":false,"merged":[[1,0,1,6],[0,0,0,6],[2,0,2,6],[37,0,37,6],[5,3,5,6],[6,3,6,6],[14,3,14,6],[7,3,7,6],[8,3,8,6],[9,3,9,6],[12,3,12,6],[13,3,13,6],[16,3,16,6],[2,8,2,14],[24,3,24,6],[25,3,25,6],[26,3,26,6],[17,3,17,6],[20,3,20,6],[21,3,21,6],[22,3,22,6],[23,3,23,6]]}
[]
["Catering Hard Rück Cafe"]
["Bestellfristen: 1-50 Personen 2 Tage vor dem Anlass bis 10.00 Uhr / 51-100 Personen 5 Tage vor dem Anlass \nbis 10.00 Uhr / mehr als 100 Personen 10 Tage vor dem Anlass bis 10.00 Uhr."]
[]
["Angaben des Bestellers"]
["Firma"]
["Vorname/Name"]
["Strasse"]
["PLZ / Ort"]
["Telefon / E-Mail"]
[]
["Rechnungsadresse"]
["Firma"]
["Vorname / Name"]
["Kostenstelle"]
["Kostenart"]
["Strasse"]
["PLZ / Ort"]
[]
["Angaben zur Veranstaltung"]
["Veranstaltungs-Raum"]
["Name der Veranstaltung"]
["Anzahl Teilnehmer"]
["Datum und Zeit der Lieferung / Abholung"]
["Ende der Veranstaltung"]
["Bemerkungen"]
[]
[]
[null,null,null,null," "]
[null,false,"Bestellung wird abgeholt"]
[null,null,"Mit Service während der Veranstaltung"]
[null,null,"Einrichten des Raumes gewünscht"]
[]
[null,"Der Besteller/die Bestellerin akzeptiert die Allgemeinen Geschäftsbedingungen von Eldora."]

{"sheet":"Zusammenfassung","index":1,"n_rows":10,"n_cols":3,"rows_kept":10,"cut":false,"hidden":false,"merged":[[1,0,1,4]]}
[]
["Zusammenfassung Ihrer Bestellung"]
[]
[]
["anzeige","x"]
[]
["Bestellung","Bestellung","Totalbetrag"]
["Coffeebreak",10,105]
["Morning Coffeebreak Basic",10,105]
["Gesamttotal",10,105]

{"sheet":"Coffeebreak","index":2,"n_rows":92,"n_cols":10,"rows_kept":92,"cut":false,"hidden":false,"merged":[[2,0,2,7],[23,0,23,7],[36,0,36,7],[0,0,0,6],[1,0,1,7]]}
[]
["Coffeebreak"]
["Morning Coffeebreak Packages"]
[null,null,null,null,"Preis",null,"Einheit","Betrag inkl.  MwSt",null,{"$f":"IF(ISBLANK(A7),\"\",C7)","v":""}]
[]
[10,null,"Morning Coffeebreak Basic",null,10.5,"/","Pers.",{"$f":"A6*E6","v":105}]
[null,null,"ab 5 Personen"]
[null,null,"Auswahl von Buttergipfel, Laugengipfel, Rusticogipfel,"]
[null,null,"Kaffee, Tee, Mineralwasser"]
[]
[null,null,"Morning Coffeebreak Classic",null,13.5,"/","Pers.",{"$f":"A11*E11","v":0}]
[null,null,"ab 5 Personen"]
[null,null,"Auswahl von Buttergipfel, Laugengipfel, Rusticogipfel, "]
[null,null,"Kaffee, Tee, Mineralwasser, Softgetränke, "]
[null,null,"Orangensaft, Früchteschale"]
[]
[null,null,"Morning Coffeebreak Sunrise",null,19.5,"/","Pers.",{"$f":"A17*E17","v":0}]
[null,null,"ab 20 Personen"]
[null,null,"Auswahl von Buttergipfel, Laugengipfel, Rusticogipfel, Kleinbrötli,"]
[null,null,"Kaffee, Tee, Mineralwasser, Softgetränke, Orangensaft, "]
[null,null,"Fruchtschale, Birchermüesli im Glas"]
[null,null,"Kleiner Schinken-Käseteller"]
[]
["Afternoon Coffeebreak Packages"]
[null,null,null,null,"Preis",null,"Einheit","Betrag inkl.  MwSt"]
[]
[null,null,"Afternoon Coffeebreak Sunset",null,18.5,"/","Pers.",{"$f":"A27*E27","v":0}]
[null,null,"ab 10 Personen"]
[null,null,"Kaffee, Tee, Mineralwasser, Softgetränke, "]
[null,null,"Orangensaft, Mini Patisserie assortiert"]
[]
[null,null,"Coffeebreak Light",null,9,"/","Pers.",{"$f":"A32*E32","v":0}]
[null,null,"ab 5 Personen"]
[null,null,"Kaffee, Tee, Mineralwasser, Softgetränke,"]
[null,null,"Orangensaft"]
[]
["Coffeebreak à la Carte"]
[]
[null,null,"Frühstücksgebäck",null,"Preis",null,"Einheit","Betrag inkl.  MwSt"]
[]
{"$rows_left_out":53}
{"sheet":"Working Lunch","index":3,"n_rows":52,"n_cols":8,"rows_kept":52,"cut":false,"hidden":false,"merged":[[0,0,0,6],[1,0,1,7],[45,0,45,7],[29,0,29,7],[2,0,2,7]]}
[]
["Working Lunch"]
["Working Lunch Platten"]
[]
[null,null,null,null,"Preis",null,"Einheit","Betrag inkl.  MwSt"]
[]
[null,null,"Käseplatte für 4 Personen",null,56.5,"/","Person",{"$f":"A7*E7","v":0}]
[null,null,"150g pro Person"]
[]
[null,null,"Tête de Moine, Gruyère, Tilsiter, Brie, Geissenfrischkäse,"]
[null,null,"Weintrauben, Nüsse, Trockenfrüchte,"]
[null,null,"dazu servieren wir knuspriges Huusbrot und Baguette"]
[]
[null,null,"Älplerplatte für 4 Personen",null,56.5,"/","Person",{"$f":"A14*E14","v":0}]
[null,null,"150g pro Person"]
[]
[null,null,"Bündner Rohschinken, Coppa, Salami, Bündner Bergkäse,"]
[null,null,"Oliven, Gurken, Maiskölbchen, Cherrytomaten,"]
[null,null,"dazu servieren wir knuspriges Huusbrot und Baguette"]
[]
[]
[null,null,"Fleischplatte für 4 Personen",null,56.5,"/","Person",{"$f":"A22*E22","v":0}]
[null,null,"100g pro Person"]
[]
[null,null,"Bauern-Schinken, Salami, diverse Aufschnitte,"]
[null,null,"Pastete, Fleischkäse, Essiggemüse, Cherrytomaten,"]
[null,null,"dazu servieren wir knuspriges Huusbrot und Baguette"]
[]
[]
["Working Lunch à la carte"]
[]
[null,null,null,null,null,null,null,"Betrag inkl.  MwSt"]
[null,null,"Mini Sandwiches"]
[null,null,"Mindestbestellmenge: 4 Stück pro Sorte"]
[]
[null,null,"Mini-Pastorello mit Salami",null,3.5,"/","Stk.",{"$f":"A36*E36","v":0}]
[null,null,"Mini-Castellino mit Käse",null,3.5,"/","Stk.",0]
[null,null,"Mini-Semmeli mit Schinken",null,3.5,"/","Stk.",0]
[null,null,"Mini-Nussbrötli mit Brie",null,3.5,"/","Stk.",0]
[null,null,"Mini-Teebrötli mit Ei",null,3.5,"/","Stk.",0]
{"$rows_left_out":13}
{"sheet":"Apéro","index":4,"n_rows":153,"n_cols":11,"rows_kept":153,"cut":false,"hidden":false,"merged":[[87,0,87,7],[1,0,1,7],[30,0,30,7],[2,0,2,7],[31,0,31,7],[86,0,86,7]]}
[]
["Apéro"]
["Apéro Platten"]
[]
[null,null,null,null,"Preis",null,"Einheit","Betrag inkl.  MwSt"]
[]
[null,null,"Käseplatte",null,56.5,"/","Person",{"$f":"A7*E7","v":0}]
[null,null,"für 4 Personen"]
[]
[null,null,"Tête de Moine, Gruyère, Tilsiter, Brie, Geissenfrischkäse,"]
[null,null,"Weintrauben, Nüsse, Trockenfrüchte,"]
[null,null,"dazu servieren wir knuspriges Huusbrot und Baguette"]
[null,null,"(ca. 150g pro Person)"]
[]
[null,null,"Älplerplatte",null,56.5,"/","Person",{"$f":"A15*E15","v":0}]
[null,null,"für 4 Personen"]
[]
[null,null,"Bündner Rohschinken, Coppa, Salami, Bündner Bergkäse,"]
[null,null,"Oliven, Gurken, Maiskölbchen, Cherrytomaten,"]
[null,null,"dazu servieren wir knuspriges Huusbrot und Baguette"]
[null,null,"(ca. 150g pro Person)",null,null,null,null,null,null," "]
[]
[null,null,"Fleischplatte",null,56.5,"/","Person",{"$f":"A23*E23","v":0}]
[null,null,"für 4 Personen"]
[]
[null,null,"Bauern-Schinken, Salami, diverse Aufschnitte,"]
[null,null,"Pastete, Fleischkäse, Essiggemüse, Cherrytomaten,"]
[null,null,"dazu servieren wir knuspriges Huusbrot und Baguette"]
[null,null,"(ca. 100g pro Person)"]
[]
[]
["Apéro Packages"]
[]
[null,null,null,null,"Preis",null,"Einheit","Betrag inkl.  MwSt"]
[null,null,"Small Apéro",null,8.5,"/","Person",{"$f":"A38*E35","v":0}]
[null,null,"Mindestbestellmenge: 6 Personen"]
[]
[null,null,"Nüssli, Chips, Blätterteigstangen "]
[]
[null,null,"Medium Apéro",null,12.8,"/","Person",{"$f":"A40*E40","v":0}]
{"$rows_left_out":114}
{"sheet":"Getränke","index":5,"n_rows":42,"n_cols":8,"rows_kept":42,"cut":false,"hidden":false,"merged":[[41,0,41,7],[0,0,0,6],[32,0,32,7],[1,0,1,7],[33,0,33,7],[2,0,2,7]]}
[]
["Getränke"]
["Soft Getränke"]
[]
[null,null,null,null,"Preis",null,"Einheit","Betrag inkl.  MwSt"]
[null,null,"Kaffee & Tee"]
[]
[null,null,"Nespresso Espresso",null,2,"/","Stk.",{"$f":"A8*E8","v":0}]
[null,null,"Nespresso Kaffee Crème",null,2,"/","Stk.",{"$f":"A9*E9","v":0}]
[null,null,"Tee assortiert",null,2,"/","Stk.",0]
[]
[null,null,"Kalte Getränke 5dl PET"]
[]
[null,null,"Valser mit Kohlensäure",null,2.8,"/","Stk.",{"$f":"A14*E14","v":0}]
[null,null,"Valser ohne Kohlensäure",null,2.8,"/","Stk.",0]
[null,null,"Coca-Cola",null,2.8,"/","Stk.",0]
[null,null,"Coca-Cola Zero",null,2.8,"/","Stk.",0]
[null,null,"Nestea Lemon",null,2.8,"/","Stk.",0]
[null,null,"Rivella Rot",null,2.8,"/","Stk.",0]
[null,null,"Rivella Blau",null,2.8,"/","Stk.",0]
[null,null,"Red Bull",null,3.5,"/","Stk.",0]
[]
[null,null,"Kalte Getränke 1 Liter"]
[]
[null,null,"Valser mit Kohlensäure",null,4.5,"/","Fl.",{"$f":"A25*E25","v":0}]
[null,null,"Valser ohne Kohlensäure",null,4.5,"/","Fl.",0]
[]
[null,null,"Juices"]
[]
[null,null,"Orangensaft, 1L",null,6.5,"/","Stk.",{"$f":"A30*E30","v":0}]
[null,null,"Orangensaft frisch gepresst, 1 L",null,15,"/","Stk.",0]
[]
[]
["Alkoholische Getränke"]
[]
[null,null,null,null,"Preis",null,"Einheit","Betrag inkl.  MwSt"]
[null,null,"Schweizer Bier"]
[]
[null,null,"S`Bier",null,4.5,"/","Fl.",{"$f":"A39*E39","v":0}]
[null,null,"Feldschlösschen mit und ohne Alkohol",null,3.5,"/","Fl.",0]
{"$rows_left_out":3}
{"sheet":"Miete Geschirr","index":6,"n_rows":53,"n_cols":8,"rows_kept":53,"cut":false,"hidden":false,"merged":[[63,0,63,6],[0,0,0,6],[62,0,62,6],[2,0,2,7],[5,0,8,7],[1,0,1,7]]}
[]
["Miete Geschirr"]
["Miete Geschirr"]
[]
[]
["Wir verrechnen keine Geschirrmiete, wenn Sie bei uns einen Anlass buchen. Im Preis inbegriffen ist das Abwaschen und Reinigen der gemieteten Gegen-stände. Bei Zulieferung gelten die üblichen Lieferkosten gemäss AGB. Fehlendes oder beschädigtes Material wird verrechnet gemäss Ersatzkostenreglement in den AGB."]
[]
[]
[]
[]
[null,null,"Geschirr",null,"Preis",null,"Einheit","Betrag inkl.  MwSt"]
[]
[null,null,"Teller, 28cm",null,2,"/","Stk.",{"$f":"A13*E13","v":0}]
[null,null,"Teller, 24cm",null,2,"/","Stk.",{"$f":"A14*E14","v":0}]
[null,null,"Teller, 18cm",null,1.5,"/","Stk.",0]
[null,null,"Salat-Teller klein",null,1,"/","Stk.",0]
[null,null,"Suppenschale",null,1,"/","Stk.",0]
[null,null,"Kaffeetasse mit Unterteller",null,2,"/","Stk.",0]
[null,null,"Espressotasse mit Unterteller",null,2,"/","Stk.",0]
[]
[null,null,"Besteck"]
[]
[null,null,"Messer",null,1,"/","Person",{"$f":"A23*E23","v":0}]
[null,null,"Gabel",null,1,"/","Person",0]
[null,null,"Suppenlöffel",null,1,"/","Person",0]
[null,null,"Kaffeelöffel",null,1,"/","Person",0]
[null,null,"Schöpfkelle",null,2,"/","Person",0]
[null,null,"Zange",null,2,"/","Person",0]
[]
[null,null,"Gläser"]
[]
[null,null,"Champagnerglas",null,1,"/","Stk.",{"$f":"A32*E32","v":0}]
[null,null,"Rotweinglas",null,1,"/","Stk.",0]
[null,null,"Weissweinglas",null,1,"/","Stk.",0]
[null,null,"Wasserglas, 2.5dl",null,1,"/","Stk.",0]
[]
[null,null,"Zubehör"]
[]
[null,null,"Korkenzieher",null,15,"/","Stk.",{"$f":"A39*E39","v":0}]
[null,null,"Grosses Messer",null,25,"/","Stk.",0]
{"$rows_left_out":14}
{"sheet":"VIP Lunch","index":7,"n_rows":44,"n_cols":5,"rows_kept":44,"cut":false,"hidden":false,"merged":[[0,0,0,7],[1,0,1,7],[11,2,11,7],[16,2,16,7],[44,3,44,7],[33,3,33,7],[35,3,35,7],[42,3,42,7],[43,3,43,7],[36,3,36,7],[37,3,37,7],[38,3,38,7],[39,3,39,7],[26,3,26,7],[29,3,29,7],[30,3,30,7],[31,3,31,7],[32,3,32,7],[25,3,25,7],[21,3,21,7],[22,3,22,7],[23,3,23,7],[24,3,24,7]]}
[]
["VIP LUNCH"]
[]
[null,null,"Wir bieten bediente VIP Lunches ab 4 Personen an. Gerne stellen wir Ihnen ein individuelles"]
[null,null,"Angebot zusammen, ausgerichtet auf Ihren speziellen Anlass, und auch mit Augenmerk auf"]
[null,null,"saisonale Produkte."]
[]
[null,null,"Bitte füllen Sie die nachfolgenden Angaben zu Ihrer Veranstaltung aus, damit wir Ihnen"]
[null,null,"eine massgeschneiderte Offerte zustellen können."]
[]
[null,null,"Eldora AG"]
[null,null,"Mitarbeiterrestaurant New Re"]
[null,null,"New Reinsurance Company Ltd."]
[null,null,"Zollikerstrasse 226"]
[null,null,"8008 Zürich"]
[]
[null,null,"Betriebsleiter: Michael Graf"]
[null,null,"T +41 44 811 00 31"]
[null,null,"9427-grt@eldora.ch"]
[]
[]
[null,null,"Vorname"]
[null,null,"Nachname"]
[null,null,"Strasse"]
[null,null,"Postleitzahl / Stadt"]
[null,null,"Kostenstelle"]
[null,null,"Telefonnummer"]
[null,null,"E-Mail"]
[]
[null,null,"Veranstaltungs-Raum"]
[null,null,"Name der Veranstaltung"]
[null,null,"Anzahl Personen"]
[null,null,"Datum/Zeit Veranstaltung"]
[null,null,"Ende der Veranstaltung"]
[]
[null,null,"Anzahl Gänge","     Vorspeise"]
[null,null,"gewünschtes bitte","     Salat"]
[null,null,"ankreuzen","     Suppe"]
[null,null,null,"     Hauptgang"]
[null,null,null,"     Dessert"]
{"$rows_left_out":5}
{"sheet":"AGB","index":8,"n_rows":2,"n_cols":1,"rows_kept":2,"cut":false,"hidden":false,"merged":[[0,0,0,7],[1,0,1,7],[64,0,64,7],[65,0,65,7]]}
[]
["Allgemeine Geschäftsbedingungen"]

{"sheet":"Anzeige","index":9,"n_rows":146,"n_cols":6,"rows_kept":146,"cut":false,"hidden":true,"merged":[]}
["Kategorie","Artikel","Anzahl","Stückpreis","Total","anzeige"]
[{"$f":"Coffeebreak!$A$2","v":"Coffeebreak"},{"$f":"Coffeebreak!C6","v":"Morning Coffeebreak Basic"},{"$f":"INDEX(Coffeebreak!$A$6:$A$23,MATCH(Anzeige!B2,Coffeebreak!$C$6:$C$22,0))","v":10},{"$f":"Coffeebreak!E6","v":10.5},{"$f":"D2*C2","v":105},{"$f":"IF(C2=0,\"\",\"x\")","v":"x"}]
[{"$f":"Coffeebreak!$A$2","v":"Coffeebreak"},{"$f":"Coffeebreak!C11","v":"Morning Coffeebreak Classic"},{"$f":"INDEX(Coffeebreak!$A$6:$A$23,MATCH(Anzeige!B3,Coffeebreak!$C$6:$C$22,0))","v":0},{"$f":"Coffeebreak!E11","v":13.5},{"$f":"D3*C3","v":0},{"$f":"IF(C3=0,\"\",\"x\")","v":""}]
[{"$f":"Coffeebreak!$A$2","v":"Coffeebreak"},{"$f":"Coffeebreak!C17","v":"Morning Coffeebreak Sunrise"},{"$f":"INDEX(Coffeebreak!$A$6:$A$23,MATCH(Anzeige!B4,Coffeebreak!$C$6:$C$22,0))","v":0},{"$f":"Coffeebreak!E17","v":19.5},0,""]
[{"$f":"Coffeebreak!$A$2","v":"Coffeebreak"},{"$f":"Coffeebreak!C27","v":"Afternoon Coffeebreak Sunset"},{"$f":"INDEX(Coffeebreak!A27:A35,MATCH(Anzeige!B5,Coffeebreak!C27:C35,0))","v":0},{"$f":"Coffeebreak!E27","v":18.5},0,""]
[{"$f":"Coffeebreak!$A$2","v":"Coffeebreak"},{"$f":"Coffeebreak!C32","v":"Coffeebreak Light"},{"$f":"INDEX(Coffeebreak!A29:A36,MATCH(Anzeige!B6,Coffeebreak!C29:C37,0))","v":0},{"$f":"Coffeebreak!E32","v":9},0,""]
[{"$f":"Coffeebreak!$A$2","v":"Coffeebreak"},{"$f":"Coffeebreak!C41","v":"Buttergipfel"},{"$f":"INDEX(Coffeebreak!$A$41:$A$74,MATCH(Anzeige!B7,Coffeebreak!$C$41:$C$74,0))","v":0},{"$f":"Coffeebreak!E41","v":1.4},0,""]
[{"$f":"Coffeebreak!$A$2","v":"Coffeebreak"},{"$f":"Coffeebreak!C42","v":"Laugengipfel"},{"$f":"INDEX(Coffeebreak!$A$41:$A$74,MATCH(Anzeige!B8,Coffeebreak!$C$41:$C$74,0))","v":0},{"$f":"Coffeebreak!E42","v":1.4},0,""]
[{"$f":"Coffeebreak!$A$2","v":"Coffeebreak"},{"$f":"Coffeebreak!C43","v":"Verschiedene Kleinbrötli (5 Sorten gemischt)"},{"$f":"INDEX(Coffeebreak!$A$41:$A$74,MATCH(Anzeige!B9,Coffeebreak!$C$41:$C$74,0))","v":0},{"$f":"Coffeebreak!E43","v":1.5},0,""]
[{"$f":"Coffeebreak!$A$2","v":"Coffeebreak"},{"$f":"Coffeebreak!C47","v":"Butter 10g"},{"$f":"INDEX(Coffeebreak!$A$41:$A$74,MATCH(Anzeige!B10,Coffeebreak!$C$41:$C$74,0))","v":0},{"$f":"Coffeebreak!E47","v":0.4},0,""]
[{"$f":"Coffeebreak!$A$2","v":"Coffeebreak"},{"$f":"Coffeebreak!C48","v":"Konfitüre 25g"},{"$f":"INDEX(Coffeebreak!$A$41:$A$74,MATCH(Anzeige!B11,Coffeebreak!$C$41:$C$74,0))","v":0},{"$f":"Coffeebreak!E48","v":0.4},0,""]
[{"$f":"Coffeebreak!$A$2","v":"Coffeebreak"},{"$f":"Coffeebreak!C49","v":"Honig 25g"},{"$f":"INDEX(Coffeebreak!$A$41:$A$74,MATCH(Anzeige!B12,Coffeebreak!$C$41:$C$74,0))","v":0},{"$f":"Coffeebreak!E49","v":0.4},0,""]
[{"$f":"Coffeebreak!$A$2","v":"Coffeebreak"},{"$f":"Coffeebreak!C53","v":"Chocolate Muffin"},{"$f":"INDEX(Coffeebreak!$A$41:$A$74,MATCH(Anzeige!B13,Coffeebreak!$C$41:$C$74,0))","v":0},{"$f":"Coffeebreak!E53","v":2.9},0,""]
[{"$f":"Coffeebreak!$A$2","v":"Coffeebreak"},{"$f":"Coffeebreak!C54","v":"Berry Muffin"},{"$f":"INDEX(Coffeebreak!$A$41:$A$74,MATCH(Anzeige!B14,Coffeebreak!$C$41:$C$74,0))","v":0},{"$f":"Coffeebreak!E54","v":2.9},0,""]
[{"$f":"Coffeebreak!$A$2","v":"Coffeebreak"},{"$f":"Coffeebreak!C55","v":"Schokolade-Cake"},{"$f":"INDEX(Coffeebreak!$A$41:$A$74,MATCH(Anzeige!B15,Coffeebreak!$C$41:$C$74,0))","v":0},{"$f":"Coffeebreak!E55","v":2.9},0,""]
[{"$f":"Coffeebreak!$A$2","v":"Coffeebreak"},{"$f":"Coffeebreak!C56","v":"Marmor-Cake"},{"$f":"INDEX(Coffeebreak!$A$41:$A$74,MATCH(Anzeige!B16,Coffeebreak!$C$41:$C$74,0))","v":0},{"$f":"Coffeebreak!E56","v":2.9},0,""]
[{"$f":"Coffeebreak!$A$2","v":"Coffeebreak"},{"$f":"Coffeebreak!C57","v":"Zitronen-Cake"},{"$f":"INDEX(Coffeebreak!$A$41:$A$74,MATCH(Anzeige!B17,Coffeebreak!$C$41:$C$74,0))","v":0},{"$f":"Coffeebreak!E57","v":2.9},0,""]
[{"$f":"Coffeebreak!$A$2","v":"Coffeebreak"},{"$f":"Coffeebreak!C61","v":"Nussgipfel"},{"$f":"INDEX(Coffeebreak!$A$41:$A$74,MATCH(Anzeige!B18,Coffeebreak!$C$41:$C$74,0))","v":0},{"$f":"Coffeebreak!E61","v":2.9},0,""]
[{"$f":"Coffeebreak!$A$2","v":"Coffeebreak"},{"$f":"Coffeebreak!C62","v":"Mandelgipfel"},{"$f":"INDEX(Coffeebreak!$A$41:$A$74,MATCH(Anzeige!B19,Coffeebreak!$C$41:$C$74,0))","v":0},{"$f":"Coffeebreak!E62","v":2.9},0,""]
[{"$f":"Coffeebreak!$A$2","v":"Coffeebreak"},{"$f":"Coffeebreak!C63","v":"Cailler Schoggigipfel"},{"$f":"INDEX(Coffeebreak!$A$41:$A$74,MATCH(Anzeige!B20,Coffeebreak!$C$41:$C$74,0))","v":0},{"$f":"Coffeebreak!E63","v":2.6},0,""]
[{"$f":"Coffeebreak!$A$2","v":"Coffeebreak"},{"$f":"Coffeebreak!C64","v":"Vanillecrèmegipfel"},{"$f":"INDEX(Coffeebreak!$A$41:$A$74,MATCH(Anzeige!B21,Coffeebreak!$C$41:$C$74,0))","v":0},{"$f":"Coffeebreak!E64","v":2.9},0,""]
[{"$f":"Coffeebreak!$A$2","v":"Coffeebreak"},{"$f":"Coffeebreak!C65","v":"Trockenstückli, assortiert "},{"$f":"INDEX(Coffeebreak!$A$41:$A$74,MATCH(Anzeige!B22,Coffeebreak!$C$41:$C$74,0))","v":0},{"$f":"Coffeebreak!E65","v":3.5},0,""]
[{"$f":"Coffeebreak!$A$2","v":"Coffeebreak"},{"$f":"Coffeebreak!C69","v":"Mini Patisserie assortiert"},{"$f":"INDEX(Coffeebreak!$A$41:$A$74,MATCH(Anzeige!B23,Coffeebreak!$C$41:$C$74,0))","v":0},{"$f":"Coffeebreak!E69","v":2},0,""]
[{"$f":"Coffeebreak!$A$2","v":"Coffeebreak"},{"$f":"Coffeebreak!C70","v":"Fruchtsalat im Glas"},{"$f":"INDEX(Coffeebreak!$A$41:$A$74,MATCH(Anzeige!B24,Coffeebreak!$C$41:$C$74,0))","v":0},{"$f":"Coffeebreak!E70","v":2.5},0,""]
[{"$f":"Coffeebreak!$A$2","v":"Coffeebreak"},{"$f":"Coffeebreak!C75","v":"Fruchtsalat im Glas"},{"$f":"INDEX(Coffeebreak!$A$41:$A$74,MATCH(Anzeige!B25,Coffeebreak!$C$41:$C$74,0))","v":0},{"$f":"Coffeebreak!E75","v":3.5},0,""]
[{"$f":"Coffeebreak!$A$2","v":"Coffeebreak"},{"$f":"Coffeebreak!C76","v":"Saisonale Früchte geschnitten im Glas"},{"$f":"INDEX(Coffeebreak!$A$75:$A$94,MATCH(Anzeige!B26,Coffeebreak!$C$75:$C$94,0))","v":0},{"$f":"Coffeebreak!E76","v":3.5},0,""]
[{"$f":"Coffeebreak!$A$2","v":"Coffeebreak"},{"$f":"Coffeebreak!C77","v":"Früchte-Korb für 5 Personen"},{"$f":"INDEX(Coffeebreak!$A$75:$A$94,MATCH(Anzeige!B27,Coffeebreak!$C$75:$C$94,0))","v":0},{"$f":"Coffeebreak!E77","v":8},0,""]
[{"$f":"Coffeebreak!$A$2","v":"Coffeebreak"},{"$f":"Coffeebreak!C78","v":"Früchte-Korb für 15 Personen"},{"$f":"INDEX(Coffeebreak!$A$75:$A$94,MATCH(Anzeige!B28,Coffeebreak!$C$75:$C$94,0))","v":0},{"$f":"Coffeebreak!E78","v":20},0,""]
[{"$f":"Coffeebreak!$A$2","v":"Coffeebreak"},{"$f":"Coffeebreak!C79","v":"Früchte-Korb für 25 Personen"},{"$f":"INDEX(Coffeebreak!$A$75:$A$94,MATCH(Anzeige!B29,Coffeebreak!$C$75:$C$94,0))","v":0},{"$f":"Coffeebreak!E79","v":30},0,""]
[{"$f":"Coffeebreak!$A$2","v":"Coffeebreak"},{"$f":"Coffeebreak!C83","v":"Mini-Pastorello mit Salami"},{"$f":"INDEX(Coffeebreak!$A$75:$A$94,MATCH(Anzeige!B30,Coffeebreak!$C$75:$C$94,0))","v":0},{"$f":"Coffeebreak!E83","v":3.5},0,""]
[{"$f":"Coffeebreak!$A$2","v":"Coffeebreak"},{"$f":"Coffeebreak!C84","v":"Mini-Castellino mit Käse"},{"$f":"INDEX(Coffeebreak!$A$75:$A$94,MATCH(Anzeige!B31,Coffeebreak!$C$75:$C$94,0))","v":0},{"$f":"Coffeebreak!E84","v":3.5},0,""]
[{"$f":"Coffeebreak!$A$2","v":"Coffeebreak"},{"$f":"Coffeebreak!C85","v":"Mini-Semmeli mit Schinken"},{"$f":"INDEX(Coffeebreak!$A$75:$A$94,MATCH(Anzeige!B32,Coffeebreak!$C$75:$C$94,0))","v":0},{"$f":"Coffeebreak!E85","v":3.5},0,""]
[{"$f":"Coffeebreak!$A$2","v":"Coffeebreak"},{"$f":"Coffeebreak!C86","v":"Mini-Nussbrötli mit Brie"},{"$f":"INDEX(Coffeebreak!$A$75:$A$94,MATCH(Anzeige!B33,Coffeebreak!$C$75:$C$94,0))","v":0},{"$f":"Coffeebreak!E86","v":3.5},0,""]
[{"$f":"Coffeebreak!$A$2","v":"Coffeebreak"},{"$f":"Coffeebreak!C87","v":"Mini-Teebrötli mit Ei"},{"$f":"INDEX(Coffeebreak!$A$75:$A$94,MATCH(Anzeige!B34,Coffeebreak!$C$75:$C$94,0))","v":0},{"$f":"Coffeebreak!E87","v":3.5},0,""]
[{"$f":"Coffeebreak!$A$2","v":"Coffeebreak"},{"$f":"Coffeebreak!C88","v":"Mini-Ciabatta mit Tomaten-Mozzarella"},{"$f":"INDEX(Coffeebreak!$A$75:$A$94,MATCH(Anzeige!B35,Coffeebreak!$C$75:$C$94,0))","v":0},{"$f":"Coffeebreak!E88","v":3.5},0,""]
[{"$f":"Coffeebreak!$A$2","v":"Coffeebreak"},{"$f":"Coffeebreak!C89","v":"Mini-Laugenbrötli mit Lachs"},{"$f":"INDEX(Coffeebreak!$A$75:$A$94,MATCH(Anzeige!B36,Coffeebreak!$C$75:$C$94,0))","v":0},{"$f":"Coffeebreak!E89","v":4},0,""]
[{"$f":"Coffeebreak!$A$2","v":"Coffeebreak"},{"$f":"Coffeebreak!C90","v":"Mini-Laugenbrötli mit Rohschinken"},{"$f":"INDEX(Coffeebreak!$A$75:$A$94,MATCH(Anzeige!B37,Coffeebreak!$C$75:$C$94,0))","v":0},{"$f":"Coffeebreak!E90","v":4},0,""]
[{"$f":"Coffeebreak!$A$2","v":"Coffeebreak"},{"$f":"Coffeebreak!C91","v":"Mini-Laugenbrötli mit Mostbröckli"},{"$f":"INDEX(Coffeebreak!$A$75:$A$94,MATCH(Anzeige!B38,Coffeebreak!$C$75:$C$94,0))","v":0},{"$f":"Coffeebreak!E91","v":4},0,""]
[{"$f":"Coffeebreak!$A$2","v":"Coffeebreak"},{"$f":"Coffeebreak!C92","v":"Mini-Graham mit Thonfüllung"},{"$f":"INDEX(Coffeebreak!$A$75:$A$94,MATCH(Anzeige!B39,Coffeebreak!$C$75:$C$94,0))","v":0},{"$f":"Coffeebreak!E92","v":4},0,""]
[{"$f":"'Working Lunch'!$A$2","v":"Working Lunch"},{"$f":"'Working Lunch'!C7","v":"Käseplatte für 4 Personen"},{"$f":"INDEX('Working Lunch'!A7:A27,MATCH(Anzeige!B40,'Working Lunch'!C7:C27,0))","v":0},{"$f":"'Working Lunch'!E7","v":56.5},0,""]
{"$rows_left_out":107}
{"sheet":"Tabelle1","index":10,"n_rows":0,"n_cols":0,"rows_kept":0,"cut":false,"hidden":false,"merged":[]}