{"text_format":"1","workbook":"xlsx","n_sheets":10,"sheets":["Angaben für Ihr Catering","Zusammenfassung","Coffeebreak","Working Lunch","Apéro","Getränke","Miete Geschirr","VIP-Lunch","AGB","Anzeige"],"not_rendered":{"charts":0,"images":5,"macros":1,"external_links":0,"defined_names":12,"comments":0,"pivot_tables":1},"unopened":[],"bounds":{"document_bytes":16777216,"sheet_cells":100000,"rows_first":2000,"rows_last":500,"rows_between":2000,"halvings":0,"cell_chars":16384,"cell_head_chars":4096},"cells_cut":0,"cells_raw":0,"read":"whole","date_system":"1900"}

{"sheet":"Angaben für Ihr Catering","index":0,"n_rows":34,"n_cols":5,"rows_kept":34,"cut":false,"hidden":false,"merged":[[2,8,2,14],[24,3,24,6],[25,3,25,6],[26,3,26,6],[17,3,17,6],[20,3,20,6],[21,3,21,6],[22,3,22,6],[23,3,23,6],[1,0,1,6],[0,0,0,6],[2,0,2,6],[37,0,37,6],[5,3,5,6],[6,3,6,6],[14,3,14,6],[7,3,7,6],[8,3,8,6],[9,3,9,6],[12,3,12,6],[13,3,13,6],[16,3,16,6]]}
[]
["Catering Hard Rück Cafe"]
["Bestellfristen: 1-50 Personen 2 Tage vor dem Anlass bis 10.00 Uhr / 51-100 Personen 5 Tage vor dem Anlass \nbis 10.00 Uhr / mehr als 100 Personen 10 Tage vor dem Anlass bis 10.00 Uhr."]
[]
["Angaben des Bestellers"]
["Firma"]
["Vorname/Name"]
["Strasse"]
["PLZ / Ort"]
["Telefon / E-Mail"]
[]
["Rechnungsadresse"]
["Firma"]
["Vorname / Name"]
["Kostenstelle"]
["Kostenart"]
["Strasse"]
["PLZ / Ort"]
[]
["Angaben zur Veranstaltung"]
["Veranstaltungs-Raum"]
["Name der Veranstaltung"]
["Anzahl Teilnehmer"]
["Datum und Zeit der Lieferung / Abholung"]
["Ende der Veranstaltung"]
["Bemerkungen"]
[]
[]
[null,null,null,null," "]
[null,false,"Bestellung wird abgeholt"]
[null,null,"Mit Service während der Veranstaltung"]
[null,null,"Einrichten des Raumes gewünscht"]
[]
[null,"Der Besteller/die Bestellerin akzeptiert die Allgemeinen Geschäftsbedingungen von Eldora."]

{"sheet":"Zusammenfassung","index":1,"n_rows":10,"n_cols":3,"rows_kept":10,"cut":false,"hidden":false,"merged":[[1,0,1,4]]}
[]
["Zusammenfassung Ihrer Bestellung"]
[]
[]
["anzeige","x"]
[]
["Bestellung","Bestellung","Totalbetrag"]
["Coffeebreak",2,2.8]
["Laugengipfel",2,2.8]
["Gesamttotal",2,2.8]

{"sheet":"Coffeebreak","index":2,"n_rows":87,"n_cols":10,"rows_kept":87,"cut":false,"hidden":false,"merged":[[2,0,2,7],[58,0,58,7],[0,0,0,6],[1,0,1,7],[32,0,32,7]]}
[]
["Coffeebreak"]
["Morning Coffeebreak"]
[null,null,"GEBÄCK",null,"Preis",null,"Einheit","Betrag inkl.  MwSt"]
[]
[null,null,"Buttergipfel",null,1.4,"/","Stk.",{"$f":"A6*E6","v":0}]
[null,null,"Laugengipfel",null,1.4,"/","Stk.",0]
[null,null,"Rusticogipfel",null,1.4,"/","Stk.",{"$f":"A8*E8","v":0}]
[null,null,"Cailler Schoggigipfel",null,2.6,"/","Stk.",0]
[null,null,"Ovo Crunchy Roll",null,2.6,"/","Stk.",0]
[null,null,"Diverse Brötli  assortiert",null,1.5,"/","Stk.",0]
[]
[null,null,"EXTRAS"]
[]
[null,null,"Butter Portion",null,0.8,"/","Stk.",{"$f":"A15*E15","v":0}]
[null,null,"Konfitüre Portion",null,0.8,"/","Stk.",0]
[null,null,"Honig Portion",null,0.8,"/","Stk.",0]
[]
[null,null,"BREAKFAST PLUS"]
[]
[null,null,"Swiss Classic Birchermüesli im Glas",null,3.5,"/","Stk.",{"$f":"A21*E21","v":0}]
[null,null,"Joghurt laktosefrei diverse Sorten im Becher",null,1.5,"/","Stk.",0]
[null,null,"Frisch gepresster Orangensaft",null,4.5,"/","3dl",0]
[null,null,"Saisonaler Smoothie",null,4.5,"/","3dl",0]
[null,null,"z.B Erdbeer, Kiwi, Mango, Waldbeeren ",null,null,null,null,null,null,{"$f":"IF(ISBLANK(A28),\"\",C28)","v":""}]
[null,null,"FRUITS"]
[]
[null,null,"Fruchtsalat im Glas",null,3.5,"/","Stk.",{"$f":"A28*E28","v":0}]
[null,null,"Früchtekorb für 1-8 Personen",null,12,"/","Stk.",0]
[null,null,"Früchtekorb für 9-15 Personen",null,21,"/","Stk.",0]
[]
[]
["Coffeebreak à la Carte"]
[]
[null,null,"SWEET BAKERY",null,"Preis",null,"Einheit","Betrag inkl.  MwSt"]
[]
[null,null,"Nuss- / Mandelgipfel",null,2.9,"/","Stk.",{"$f":"A37*E37","v":0}]
[null,null,"Vanillecrèmegipfel",null,2.9,"/","Stk."]
[null,null,"Brownie",null,3,"/","Stk."]
[null,null,"Trockengebäck   assortiert",null,2,"/","Stk."]
{"$rows_left_out":48}
{"sheet":"Working Lunch","index":3,"n_rows":50,"n_cols":8,"rows_kept":50,"cut":false,"hidden":false,"merged":[[41,0,41,7],[0,0,0,6],[1,0,1,7],[40,0,40,7],[25,0,25,7],[2,0,2,7]]}
[]
["Working Lunch"]
["Homemade Sandwiches 52cm"]
[]
[null,null,"1 PARISETTE = CA. 5 PERSONEN",null,"Preis",null,"Einheit","Betrag inkl.  MwSt"]
[]
[null,null,"Parisette Laugen",null,35,"/","Stk.",{"$f":"A7*E7","v":0}]
[null,null,"Brie, Butter, Lollosalat, Gurken, Tomaten, Baumnüsse"]
[]
[null,null,"Parisette Laugen",null,35,"/","Stk.",{"$f":"A10*E10","v":0}]
[null,null,"Bergkäse, Eier, Mayonnaise, Gurken, Kresse"]
[]
[null,null,"Parisette hell",null,35,"/","Stk.",{"$f":"A13*E13","v":0}]
[null,null,"Tomate, Mozzarella, Basilikum, Pesto und Rucola"]
[]
[null,null,"Parisette hell",null,35,"/","Stk.",{"$f":"A16*E16","v":0}]
[null,null,"Trutenbrust, Ei, Tartarsauce, Cornichons, Tomate, Lollosalat"]
[]
[null,null,"Parisette dunkel",null,40,"/","Stk.",{"$f":"A19*E19","v":0}]
[null,null,"Rauchlachs, Cantadou, Kopfsalat, Kapern, Zwiebeln, Meerrettich "]
[]
[null,null,"Parisette dunkel",null,40,"/","Stk.",{"$f":"A22*E22","v":0}]
[null,null,"Roastbeef, Coleslaw, Tomate, Senfbutter, Eisbergsalat"]
[]
[]
["Lunch Packages"]
[]
[null,null,null,null,"Preis",null,"Einheit","Betrag inkl.  MwSt"]
[null,null,"LUNCH PACKAGE Sandwich",null,19.5,"/","Pers.",{"$f":"A29*E29","v":0}]
[null,null,"Ab 10 Personen"]
[null,null,"Assortierte Sandwich-Platte mit 3 Sandwiches pro Person"]
[null,null,"1 Softdrink 0.5l nach Wahl"]
[]
[null,null,"LUNCH PACKAGE Platte",null,19.5,"/","Pers.",{"$f":"A34*E34","v":0}]
[null,null,"Ab 20 Personen"]
[null,null,"Käseplatte mit diversem Hart-und Weichkäse, Fleischplatte mit diversen Fleischsorten"]
[null,null,"garniert mit Huusbrot & Baguette"]
[null,null,"Gemischter Menüsalat mit Dressing"]
[null,null,"1 Softdrink 0.5l nach Wahl"]
[]
{"$rows_left_out":11}
{"sheet":"Apéro","index":4,"n_rows":140,"n_cols":8,"rows_kept":140,"cut":false,"hidden":false,"merged":[[108,0,108,7],[64,0,64,7],[1,0,1,7],[2,0,2,7],[45,0,45,7],[46,0,46,7]]}
[]
["Apéro"]
["Apéro Packages"]
[]
[null,null,"Ab 5 Personen / je 1 Stück pro Person",null,"Preis",null,"Einheit","Betrag inkl.  MwSt"]
[]
[null,null,"Small Apéro",null,8.5,"/","Person",{"$f":"A8*E7","v":0}]
[null,null,"Nüssli, Chips, Blätterteigstangen "]
[]
[null,null,"Swiss Apéro",null,12.5,"/","Person",{"$f":"A10*E10","v":0}]
[null,null,"Party Chäschüechli"]
[null,null,"Party Schinkengipfeli"]
[null,null,"Blätterteiggebäck"]
[null,null,"Gemüsesticks mit Dip"]
[]
[null,null,"Mediterran Apéro",null,19.5,"/","Person",{"$f":"A16*E16","v":0}]
[null,null,"Marinierte Oliven und Parmesanmöckli"]
[null,null,"Grissini mit Rohschinken"]
[null,null,"Party Minipizza"]
[null,null,"Tomaten-Mozzarella Spiessli mit Balsamico"]
[null,null,"Bruschetta mit frischen Tomaten, Basilikum und Olivenöl"]
[null,null,"Vitello Tonnato"]
[]
[null,null,"Asia Apéro",null,19.5,"/","Person",{"$f":"A24*E24","v":0}]
[null,null,"Curry Cashews"]
[null,null,"Mini-Frühlingsrolle mit Sweet Chilisauce"]
[null,null,"Mini-Gemüse-Samosas mit Curry-Joghurt-Dip"]
[null,null,"Glasnudelsalat mit Koreander"]
[null,null,"Tandoori Pouletspiessli mit Erdnusssauce"]
[null,null,"Crevette auf Mango-Chili-Salat"]
[]
[]
[]
[]
[]
[]
[]
[]
[]
[]
{"$rows_left_out":101}
{"sheet":"Getränke","index":5,"n_rows":92,"n_cols":8,"rows_kept":92,"cut":false,"hidden":false,"merged":[[61,0,61,7],[0,0,0,6],[43,0,43,7],[1,0,1,7],[46,0,46,7],[2,0,2,7],[45,0,45,7]]}
[]
["Getränke"]
["Softdrinks"]
[]
[null,null,null,null,"Preis",null,"Einheit","Betrag inkl.  MwSt"]
[null,null,"Kalte Getränke   I   5dl "]
[]
[null,null,"Valser mit Kohlensäure",null,2.5,"/","Stk.",{"$f":"A8*E8","v":0}]
[null,null,"Valser ohne Kohlensäure",null,2.5,"/","Stk.",0]
[null,null,"Valser Viva",null,2.8,"/","Stk.",{"$f":"A10*E10","v":0}]
[null,null,"Coca Cola",null,2.8,"/","Stk.",0]
[null,null,"Coca Cola Zero",null,2.8,"/","Stk.",0]
[null,null,"Sprite",null,2.8,"/","Stk.",0]
[null,null,"Fanta",null,2.8,"/","Stk.",0]
[null,null,"Rivella Rot",null,2.8,"/","Stk.",0]
[null,null,"Rivella Blau",null,2.8,"/","Stk.",{"$f":"A16*E16","v":0}]
[null,null,"Rivella Grün",null,2.8,"/","Stk.",0]
[null,null,"Neste Ice Tea  Lemon",null,2.8,"/","Stk.",0]
[null,null,"Cold Brew Black Tea ASSAM",null,2.8,"/","Stk.",0]
[null,null,"VIVITZ BIO-Eistee Zitrone",null,3.5,"/","Stk.",0]
[null,null,"VIVITZ BIO-Eistee Apfelminze",null,3.5,"/","Stk.",0]
[null,null,"VIVITZ BIO-Eistee Grüntee",null,3.5,"/","Stk.",{"$f":"A22*E22","v":0}]
[null,null,"VIVITZ BIO-Eistee Easy Fruits",null,3.5,"/","Stk.",{"$f":"A23*E23","v":0}]
[null,null,"Hausgemachter Eldora-Eistee Lemongrass-Ginger",null,2.5,"/","Stk.",0]
[null,null,"Hausgemachter Eldora-Eistee Hisbiskus-Rooibos",null,2.5,"/","Stk.",0]
[null,null,"VIVITZ Schorle Rhabarber",null,3.5,"/","Stk.",0]
[null,null,"VIVITZ Schorle Apfel-Holunder",null,3.5,"/","Stk.",{"$f":"A27*E27","v":0}]
[null,null,"BIO Apfelschorle",null,3.5,"/","Stk.",0]
[null,null,"Captain Kambucha",null,3.5,"/","Stk.",0]
[null,null,"Red Bull",null,3.8,"/","Stk.",0]
[]
[null,null,"Kalte Getränke   I   1 Liter"]
[]
[null,null,"Valser mit Kohlensäure",null,4.5,"/","lt",{"$f":"A34*E34","v":0}]
[null,null,"Valser ohne Kohlensäure",null,4.5,"/","lt",0]
[null,null,"Orangensaft, 1L",null,6.5,"/","lt",{"$f":"A36*E36","v":0}]
[null,null,"Orangensaft frisch gepresst, 1 L",null,15,"/","lt",0]
[]
[null,null,"Kaffee "]
[]
{"$rows_left_out":53}
{"sheet":"Miete Geschirr","index":6,"n_rows":54,"n_cols":8,"rows_kept":54,"cut":false,"hidden":true,"merged":[[63,0,63,6],[62,0,62,6],[2,0,2,7],[5,0,8,7],[1,0,1,7]]}
[]
["Miete Geschirr"]
["Miete Geschirr"]
[]
[]
["Wir verrechnen keine Geschirrmiete, wenn Sie bei uns einen Anlass buchen. Im Preis inbegriffen ist das Abwaschen und Reinigen der gemieteten Gegen-stände. Bei Zulieferung gelten die üblichen Lieferkosten gemäss AGB. Fehlendes oder beschädigtes Material wird verrechnet gemäss Ersatzkostenreglement in den AGB."]
[]
[]
[]
[]
[null,null,"Geschirr",null,"Preis",null,"Einheit","Betrag inkl.  MwSt"]
[]
[null,null,"Teller, 28cm",null,2,"/","Stk.",{"$f":"A13*E13","v":0}]
[null,null,"Teller, 24cm",null,2,"/","Stk.",{"$f":"A14*E14","v":0}]
[null,null,"Teller, 18cm",null,1.5,"/","Stk.",0]
[null,null,"Salat-Teller klein",null,1,"/","Stk.",0]
[null,null,"Suppenschale",null,1,"/","Stk.",0]
[null,null,"Kaffeetasse mit Unterteller",null,2,"/","Stk.",0]
[null,null,"Espressotasse mit Unterteller",null,2,"/","Stk.",0]
[]
[null,null,"Besteck"]
[]
[null,null,"Messer",null,1,"/","Person",{"$f":"A23*E23","v":0}]
[null,null,"Gabel",null,1,"/","Person",0]
[null,null,"Suppenlöffel",null,1,"/","Person",0]
[null,null,"Kaffeelöffel",null,1,"/","Person",0]
[null,null,"Schöpfkelle",null,2,"/","Person",0]
[null,null,"Zange",null,2,"/","Person",0]
[]
[null,null,"Gläser"]
[]
[null,null,"Champagnerglas",null,1,"/","Stk.",{"$f":"A32*E32","v":0}]
[null,null,"Rotweinglas",null,1,"/","Stk.",0]
[null,null,"Weissweinglas",null,1,"/","Stk.",0]
[null,null,"Wasserglas, 2.5dl",null,1,"/","Stk.",0]
[]
[null,null,"Zubehör"]
[]
[null,null,"Korkenzieher",null,15,"/","Stk.",{"$f":"A39*E39","v":0}]
[null,null,"Grosses Messer",null,25,"/","Stk.",0]
{"$rows_left_out":15}
{"sheet":"VIP-Lunch","index":7,"n_rows":44,"n_cols":5,"rows_kept":44,"cut":false,"hidden":false,"merged":[[44,3,44,7],[33,3,33,7],[35,3,35,7],[42,3,42,7],[43,3,43,7],[36,3,36,7],[37,3,37,7],[38,3,38,7],[39,3,39,7],[0,0,0,7],[1,0,1,7],[11,2,11,7],[16,2,16,7],[26,3,26,7],[21,3,21,7],[22,3,22,7],[23,3,23,7],[24,3,24,7],[29,3,29,7],[30,3,30,7],[31,3,31,7],[32,3,32,7],[25,3,25,7]]}
[]
["VIP Lunch"]
[]
[null,null,"Wir bieten bediente VIP-Lunches ab 4 Personen an. Gerne stellen wir Ihnen ein individuelles"]
[null,null,"Angebot zusammen, ausgerichtet auf Ihren speziellen Anlass, und auch mit Augenmerk auf"]
[null,null,"saisonale Produkte."]
[]
[null,null,"Bitte füllen Sie die nachfolgenden Angaben zu Ihrer Veranstaltung aus, damit wir Ihnen"]
[null,null,"eine massgeschneiderte Offerte zustellen können."]
[]
[null,null,"Eldora AG"]
[null,null,"Hard Rück Café"]
[null,null,"New Reinsurance Company Ltd."]
[null,null,"Zollikerstrasse 226"]
[null,null,"8008 Zürich"]
[]
[null,null,"Betriebsleiter: Michael Graf"]
[null,null,"T +41 44 811 00 31"]
[null,null,"9427-grt@eldora.ch"]
[]
[]
[null,null,"Vorname"]
[null,null,"Nachname"]
[null,null,"Strasse"]
[null,null,"Postleitzahl / Stadt"]
[null,null,"Kostenstelle"]
[null,null,"Telefonnummer"]
[null,null,"E-Mail"]
[]
[null,null,"Veranstaltungs-Raum"]
[null,null,"Name der Veranstaltung"]
[null,null,"Anzahl Personen"]
[null,null,"Datum/Zeit Veranstaltung"]
[null,null,"Ende der Veranstaltung"]
[]
[null,null,"Anzahl Gänge","     Vorspeise"]
[null,null,"gewünschtes bitte","     Salat"]
[null,null,"ankreuzen","     Suppe"]
[null,null,null,"     Hauptgang"]
[null,null,null,"     Dessert"]
{"$rows_left_out":5}
{"sheet":"AGB","index":8,"n_rows":2,"n_cols":1,"rows_kept":2,"cut":false,"hidden":false,"merged":[[0,0,0,7],[1,0,1,7],[64,0,64,7],[65,0,65,7],[107,0,107,5]]}
[]
["Allgemeine Geschäftsbedingungen"]

{"sheet":"Anzeige","index":9,"n_rows":389,"n_cols":6,"rows_kept":389,"cut":false,"hidden":true,"merged":[]}
["Kategorie","Artikel","Anzahl","Stückpreis","Total","anzeige"]
[{"$f":"Coffeebreak!$A$2","v":"Coffeebreak"},{"$f":"Coffeebreak!C5","v":0},{"$f":"IFERROR(INDEX(Coffeebreak!$A$6:$A$87,MATCH(Anzeige!B2,Coffeebreak!$C$6:$C$87,0)),0)","v":0},{"$f":"Coffeebreak!E5","v":0},{"$f":"IFERROR(D2*C2,0)","v":0},{"$f":"IF(C2=0,\"\",\"x\")","v":""}]
[{"$f":"Coffeebreak!$A$2","v":"Coffeebreak"},{"$f":"Coffeebreak!C6","v":"Buttergipfel"},{"$f":"IFERROR(INDEX(Coffeebreak!$A$6:$A$87,MATCH(Anzeige!B3,Coffeebreak!$C$6:$C$87,0)),0)","v":0},{"$f":"Coffeebreak!E6","v":1.4},{"$f":"IFERROR(D3*C3,0)","v":0},""]
[{"$f":"Coffeebreak!$A$2","v":"Coffeebreak"},{"$f":"Coffeebreak!C7","v":"Laugengipfel"},{"$f":"IFERROR(INDEX(Coffeebreak!$A$6:$A$87,MATCH(Anzeige!B4,Coffeebreak!$C$6:$C$87,0)),0)","v":0},{"$f":"Coffeebreak!E7","v":1.4},0,""]
[{"$f":"Coffeebreak!$A$2","v":"Coffeebreak"},{"$f":"Coffeebreak!C8","v":"Rusticogipfel"},{"$f":"IFERROR(INDEX(Coffeebreak!$A$6:$A$87,MATCH(Anzeige!B5,Coffeebreak!$C$6:$C$87,0)),0)","v":0},{"$f":"Coffeebreak!E8","v":1.4},0,""]
[{"$f":"Coffeebreak!$A$2","v":"Coffeebreak"},{"$f":"Coffeebreak!C9","v":"Cailler Schoggigipfel"},{"$f":"IFERROR(INDEX(Coffeebreak!$A$6:$A$87,MATCH(Anzeige!B6,Coffeebreak!$C$6:$C$87,0)),0)","v":0},{"$f":"Coffeebreak!E9","v":2.6},0,""]
[{"$f":"Coffeebreak!$A$2","v":"Coffeebreak"},{"$f":"Coffeebreak!C10","v":"Ovo Crunchy Roll"},{"$f":"IFERROR(INDEX(Coffeebreak!$A$6:$A$87,MATCH(Anzeige!B7,Coffeebreak!$C$6:$C$87,0)),0)","v":0},{"$f":"Coffeebreak!E10","v":2.6},0,""]
[{"$f":"Coffeebreak!$A$2","v":"Coffeebreak"},{"$f":"Coffeebreak!C11","v":"Diverse Brötli  assortiert"},{"$f":"IFERROR(INDEX(Coffeebreak!$A$6:$A$87,MATCH(Anzeige!B8,Coffeebreak!$C$6:$C$87,0)),0)","v":0},{"$f":"Coffeebreak!E11","v":1.5},0,""]
[{"$f":"Coffeebreak!$A$2","v":"Coffeebreak"},{"$f":"Coffeebreak!C12","v":0},{"$f":"IFERROR(INDEX(Coffeebreak!$A$6:$A$87,MATCH(Anzeige!B9,Coffeebreak!$C$6:$C$87,0)),0)","v":0},{"$f":"Coffeebreak!E12","v":0},0,""]
[{"$f":"Coffeebreak!$A$2","v":"Coffeebreak"},{"$f":"Coffeebreak!C13","v":"EXTRAS"},{"$f":"IFERROR(INDEX(Coffeebreak!$A$6:$A$87,MATCH(Anzeige!B10,Coffeebreak!$C$6:$C$87,0)),0)","v":0},{"$f":"Coffeebreak!E13","v":0},0,""]
[{"$f":"Coffeebreak!$A$2","v":"Coffeebreak"},{"$f":"Coffeebreak!C14","v":0},{"$f":"IFERROR(INDEX(Coffeebreak!$A$6:$A$87,MATCH(Anzeige!B11,Coffeebreak!$C$6:$C$87,0)),0)","v":0},{"$f":"Coffeebreak!E14","v":0},0,""]
[{"$f":"Coffeebreak!$A$2","v":"Coffeebreak"},{"$f":"Coffeebreak!C15","v":"Butter Portion"},{"$f":"IFERROR(INDEX(Coffeebreak!$A$6:$A$87,MATCH(Anzeige!B12,Coffeebreak!$C$6:$C$87,0)),0)","v":0},{"$f":"Coffeebreak!E15","v":0.8},0,""]
[{"$f":"Coffeebreak!$A$2","v":"Coffeebreak"},{"$f":"Coffeebreak!C16","v":"Konfitüre Portion"},{"$f":"IFERROR(INDEX(Coffeebreak!$A$6:$A$87,MATCH(Anzeige!B13,Coffeebreak!$C$6:$C$87,0)),0)","v":0},{"$f":"Coffeebreak!E16","v":0.8},0,""]
[{"$f":"Coffeebreak!$A$2","v":"Coffeebreak"},{"$f":"Coffeebreak!C17","v":"Honig Portion"},{"$f":"IFERROR(INDEX(Coffeebreak!$A$6:$A$87,MATCH(Anzeige!B14,Coffeebreak!$C$6:$C$87,0)),0)","v":0},{"$f":"Coffeebreak!E17","v":0.8},0,""]
[{"$f":"Coffeebreak!$A$2","v":"Coffeebreak"},{"$f":"Coffeebreak!C18","v":0},{"$f":"IFERROR(INDEX(Coffeebreak!$A$6:$A$87,MATCH(Anzeige!B15,Coffeebreak!$C$6:$C$87,0)),0)","v":0},{"$f":"Coffeebreak!E18","v":0},0,""]
[{"$f":"Coffeebreak!$A$2","v":"Coffeebreak"},{"$f":"Coffeebreak!C19","v":"BREAKFAST PLUS"},{"$f":"IFERROR(INDEX(Coffeebreak!$A$6:$A$87,MATCH(Anzeige!B16,Coffeebreak!$C$6:$C$87,0)),0)","v":0},{"$f":"Coffeebreak!E19","v":0},0,""]
[{"$f":"Coffeebreak!$A$2","v":"Coffeebreak"},{"$f":"Coffeebreak!C20","v":0},{"$f":"IFERROR(INDEX(Coffeebreak!$A$6:$A$87,MATCH(Anzeige!B17,Coffeebreak!$C$6:$C$87,0)),0)","v":0},{"$f":"Coffeebreak!E20","v":0},0,""]
[{"$f":"Coffeebreak!$A$2","v":"Coffeebreak"},{"$f":"Coffeebreak!C21","v":"Swiss Classic Birchermüesli im Glas"},{"$f":"IFERROR(INDEX(Coffeebreak!$A$6:$A$87,MATCH(Anzeige!B18,Coffeebreak!$C$6:$C$87,0)),0)","v":0},{"$f":"Coffeebreak!E21","v":3.5},0,""]
[{"$f":"Coffeebreak!$A$2","v":"Coffeebreak"},{"$f":"Coffeebreak!C22","v":"Joghurt laktosefrei diverse Sorten im Becher"},{"$f":"IFERROR(INDEX(Coffeebreak!$A$6:$A$87,MATCH(Anzeige!B19,Coffeebreak!$C$6:$C$87,0)),0)","v":0},{"$f":"Coffeebreak!E22","v":1.5},0,""]
[{"$f":"Coffeebreak!$A$2","v":"Coffeebreak"},{"$f":"Coffeebreak!C23","v":"Frisch gepresster Orangensaft"},{"$f":"IFERROR(INDEX(Coffeebreak!$A$6:$A$87,MATCH(Anzeige!B20,Coffeebreak!$C$6:$C$87,0)),0)","v":0},{"$f":"Coffeebreak!E23","v":4.5},0,""]
[{"$f":"Coffeebreak!$A$2","v":"Coffeebreak"},{"$f":"Coffeebreak!C24","v":"Saisonaler Smoothie"},{"$f":"IFERROR(INDEX(Coffeebreak!$A$6:$A$87,MATCH(Anzeige!B21,Coffeebreak!$C$6:$C$87,0)),0)","v":0},{"$f":"Coffeebreak!E24","v":4.5},0,""]
[{"$f":"Coffeebreak!$A$2","v":"Coffeebreak"},{"$f":"Coffeebreak!C25","v":"z.B Erdbeer, Kiwi, Mango, Waldbeeren "},{"$f":"IFERROR(INDEX(Coffeebreak!$A$6:$A$87,MATCH(Anzeige!B22,Coffeebreak!$C$6:$C$87,0)),0)","v":0},{"$f":"Coffeebreak!E25","v":0},0,""]
[{"$f":"Coffeebreak!$A$2","v":"Coffeebreak"},{"$f":"Coffeebreak!C26","v":"FRUITS"},{"$f":"IFERROR(INDEX(Coffeebreak!$A$6:$A$87,MATCH(Anzeige!B23,Coffeebreak!$C$6:$C$87,0)),0)","v":0},{"$f":"Coffeebreak!E26","v":0},0,""]
[{"$f":"Coffeebreak!$A$2","v":"Coffeebreak"},{"$f":"Coffeebreak!C27","v":0},{"$f":"IFERROR(INDEX(Coffeebreak!$A$6:$A$87,MATCH(Anzeige!B24,Coffeebreak!$C$6:$C$87,0)),0)","v":0},{"$f":"Coffeebreak!E27","v":0},0,""]
[{"$f":"Coffeebreak!$A$2","v":"Coffeebreak"},{"$f":"Coffeebreak!C28","v":"Fruchtsalat im Glas"},{"$f":"IFERROR(INDEX(Coffeebreak!$A$6:$A$87,MATCH(Anzeige!B25,Coffeebreak!$C$6:$C$87,0)),0)","v":0},{"$f":"Coffeebreak!E28","v":3.5},0,""]
[{"$f":"Coffeebreak!$A$2","v":"Coffeebreak"},{"$f":"Coffeebreak!C29","v":"Früchtekorb für 1-8 Personen"},{"$f":"IFERROR(INDEX(Coffeebreak!$A$6:$A$87,MATCH(Anzeige!B26,Coffeebreak!$C$6:$C$87,0)),0)","v":0},{"$f":"Coffeebreak!E29","v":12},0,""]
[{"$f":"Coffeebreak!$A$2","v":"Coffeebreak"},{"$f":"Coffeebreak!C30","v":"Früchtekorb für 9-15 Personen"},{"$f":"IFERROR(INDEX(Coffeebreak!$A$6:$A$87,MATCH(Anzeige!B27,Coffeebreak!$C$6:$C$87,0)),0)","v":0},{"$f":"Coffeebreak!E30","v":21},0,""]
[{"$f":"Coffeebreak!$A$2","v":"Coffeebreak"},{"$f":"Coffeebreak!C31","v":0},{"$f":"IFERROR(INDEX(Coffeebreak!$A$6:$A$87,MATCH(Anzeige!B28,Coffeebreak!$C$6:$C$87,0)),0)","v":0},{"$f":"Coffeebreak!E31","v":0},0,""]
[{"$f":"Coffeebreak!$A$2","v":"Coffeebreak"},{"$f":"Coffeebreak!C32","v":0},{"$f":"IFERROR(INDEX(Coffeebreak!$A$6:$A$87,MATCH(Anzeige!B29,Coffeebreak!$C$6:$C$87,0)),0)","v":0},{"$f":"Coffeebreak!E32","v":0},0,""]
[{"$f":"Coffeebreak!$A$2","v":"Coffeebreak"},{"$f":"Coffeebreak!C33","v":0},{"$f":"IFERROR(INDEX(Coffeebreak!$A$6:$A$87,MATCH(Anzeige!B30,Coffeebreak!$C$6:$C$87,0)),0)","v":0},{"$f":"Coffeebreak!E33","v":0},0,""]
[{"$f":"Coffeebreak!$A$2","v":"Coffeebreak"},{"$f":"Coffeebreak!C34","v":0},{"$f":"IFERROR(INDEX(Coffeebreak!$A$6:$A$87,MATCH(Anzeige!B31,Coffeebreak!$C$6:$C$87,0)),0)","v":0},{"$f":"Coffeebreak!E34","v":0},0,""]
[{"$f":"Coffeebreak!$A$2","v":"Coffeebreak"},{"$f":"Coffeebreak!C35","v":"SWEET BAKERY"},{"$f":"IFERROR(INDEX(Coffeebreak!$A$6:$A$87,MATCH(Anzeige!B32,Coffeebreak!$C$6:$C$87,0)),0)","v":0},{"$f":"Coffeebreak!E35","v":"Preis"},0,""]
[{"$f":"Coffeebreak!$A$2","v":"Coffeebreak"},{"$f":"Coffeebreak!C36","v":0},{"$f":"IFERROR(INDEX(Coffeebreak!$A$6:$A$87,MATCH(Anzeige!B33,Coffeebreak!$C$6:$C$87,0)),0)","v":0},{"$f":"Coffeebreak!E36","v":0},0,""]
[{"$f":"Coffeebreak!$A$2","v":"Coffeebreak"},{"$f":"Coffeebreak!C37","v":"Nuss- / Mandelgipfel"},{"$f":"IFERROR(INDEX(Coffeebreak!$A$6:$A$87,MATCH(Anzeige!B34,Coffeebreak!$C$6:$C$87,0)),0)","v":0},{"$f":"Coffeebreak!E37","v":2.9},0,""]
[{"$f":"Coffeebreak!$A$2","v":"Coffeebreak"},{"$f":"Coffeebreak!C38","v":"Vanillecrèmegipfel"},{"$f":"IFERROR(INDEX(Coffeebreak!$A$6:$A$87,MATCH(Anzeige!B35,Coffeebreak!$C$6:$C$87,0)),0)","v":0},{"$f":"Coffeebreak!E38","v":2.9},0,""]
[{"$f":"Coffeebreak!$A$2","v":"Coffeebreak"},{"$f":"Coffeebreak!C39","v":"Brownie"},{"$f":"IFERROR(INDEX(Coffeebreak!$A$6:$A$87,MATCH(Anzeige!B36,Coffeebreak!$C$6:$C$87,0)),0)","v":0},{"$f":"Coffeebreak!E39","v":3},0,""]
[{"$f":"Coffeebreak!$A$2","v":"Coffeebreak"},{"$f":"Coffeebreak!C40","v":"Trockengebäck   assortiert"},{"$f":"IFERROR(INDEX(Coffeebreak!$A$6:$A$87,MATCH(Anzeige!B37,Coffeebreak!$C$6:$C$87,0)),0)","v":0},{"$f":"Coffeebreak!E40","v":2},0,""]
[{"$f":"Coffeebreak!$A$2","v":"Coffeebreak"},{"$f":"Coffeebreak!C41","v":"Mini-Patisserie    assortiert"},{"$f":"IFERROR(INDEX(Coffeebreak!$A$6:$A$87,MATCH(Anzeige!B38,Coffeebreak!$C$6:$C$87,0)),0)","v":0},{"$f":"Coffeebreak!E41","v":2},0,""]
[{"$f":"Coffeebreak!$A$2","v":"Coffeebreak"},{"$f":"Coffeebreak!C42","v":"Muffins Schoggi, Blueberry, Zitrone-Kokos"},{"$f":"IFERROR(INDEX(Coffeebreak!$A$6:$A$87,MATCH(Anzeige!B39,Coffeebreak!$C$6:$C$87,0)),0)","v":0},{"$f":"Coffeebreak!E42","v":2.9},0,""]
[{"$f":"Coffeebreak!$A$2","v":"Coffeebreak"},{"$f":"Coffeebreak!C43","v":"Mini Cake Schoggi, Marmor, Zitonen, Rüebli"},{"$f":"IFERROR(INDEX(Coffeebreak!$A$6:$A$87,MATCH(Anzeige!B40,Coffeebreak!$C$6:$C$87,0)),0)","v":0},{"$f":"Coffeebreak!E43","v":2.9},0,""]
{"$rows_left_out":349}